Target
P-selectin
Ligand
BDBM50422120
Substrate
Meas. Tech.
ChEMBL_200033 (CHEMBL882253)
IC50
20000000±n/a nM
Citation
 Kogan, TPDupré, BKeller, KMScott, ILBui, HMarket, RVBeck, PJVoytus, JARevelle, BMScott, D Rational design and synthesis of small molecule, non-oligosaccharide selectin inhibitors: (alpha-D-mannopyranosyloxy)biphenyl-substituted carboxylic acids. J Med Chem 38:4976-84 (1996)  
Target
Name:
P-selectin
Synonyms:
GMRP LYAM3_HUMAN P-selectin/P-selectin glycoprotein ligand 1 | SELP
Type:
PROTEIN
Mol. Mass.:
90834.61
Organism:
Homo sapiens (Human)
Description:
ChEMBL_1438999
Residue:
830
  
Inhibitor
Name:
BDBM50422120
Synonyms:
CHEMBL2303952
Type:
Small organic molecule
Emp. Form.:
C20H22O9
Mol. Mass.:
406.3833
SMILES:
OC[C@H]1O[C@H](Oc2ccccc2-c2ccc(OCC(O)=O)cc2)[C@@H](O)[C@H](O)[C@@H]1O
: