Target
Thyroid hormone receptor beta
Ligand
BDBM50036415
Substrate
Meas. Tech.
ChEMBL_157265 (CHEMBL765465)
IC50
1000±n/a nM
Citation
 Yokoyama, NWalker, GNMain, AJStanton, JLMorrissey, MMBoehm, CEngle, ANeubert, ADWasvary, JMStephan, ZF Synthesis and structure-activity relationships of oxamic acid and acetic acid derivatives related to L-thyronine. J Med Chem 38:695-707 (1995)  
Target
Name:
Thyroid hormone receptor beta
Synonyms:
Erba2 THB_RAT Thyroid Hormone Receptor (TR-beta) Thyroid hormone receptor beta-1 | thyroid beta
Type:
Enzyme Catalytic Domain
Mol. Mass.:
52661.52
Organism:
RAT
Description:
thyroid beta 0 RAT::P18113
Residue:
461
  
Inhibitor
Name:
BDBM50036415
Synonyms:
CHEMBL163268 | N-[3,5-Dibromo-4-(4-hydroxy-3-isopropyl-phenoxy)-phenyl]-oxalamide
Type:
Small organic molecule
Emp. Form.:
C17H16Br2N2O4
Mol. Mass.:
472.128
SMILES:
CC(C)c1cc(Oc2c(Br)cc(NC(=O)C(N)=O)cc2Br)ccc1O
: