Target
Thyroid hormone receptor beta
Ligand
BDBM50036433
Substrate
Meas. Tech.
ChEMBL_143915 (CHEMBL752718)
IC50
>5000±n/a nM
Citation
 Yokoyama, NWalker, GNMain, AJStanton, JLMorrissey, MMBoehm, CEngle, ANeubert, ADWasvary, JMStephan, ZF Synthesis and structure-activity relationships of oxamic acid and acetic acid derivatives related to L-thyronine. J Med Chem 38:695-707 (1995)  
Target
Name:
Thyroid hormone receptor beta
Synonyms:
Erba2 THB_RAT Thyroid Hormone Receptor (TR-beta) Thyroid hormone receptor beta-1 | thyroid beta
Type:
Enzyme Catalytic Domain
Mol. Mass.:
52661.52
Organism:
RAT
Description:
thyroid beta 0 RAT::P18113
Residue:
461
  
Inhibitor
Name:
BDBM50036433
Synonyms:
3-[4-(4-Hydroxy-3-isopropyl-phenoxy)-3,5-dimethyl-phenyl]-propionic acid | CHEMBL163994
Type:
Small organic molecule
Emp. Form.:
C20H24O4
Mol. Mass.:
328.4022
SMILES:
CC(C)c1cc(Oc2c(C)cc(CCC(O)=O)cc2C)ccc1O
: