Target
5-hydroxytryptamine receptor 2A
Ligand
BDBM50036434
Substrate
Meas. Tech.
ChEMBL_2604 (CHEMBL617472)
Ki
22±n/a nM
Citation
 Phillips, STde Paulis, TNeergaard, JRBaron, BMSiegel, BWSeeman, PVan Tol, HHGuan, HCSmith, HE Binding of 5H-dibenzo[a,d]cycloheptene and dibenz[b,f]oxepin analogues of clozapine to dopamine and serotonin receptors. J Med Chem 38:708-14 (1995)  
Target
Name:
5-hydroxytryptamine receptor 2A
Synonyms:
5-HT-2A 5-HT2A 5-hydroxytryptamine receptor 2A (5HT2A) Htr2 Serotonin Receptor 2A
Type:
G Protein-Coupled Receptor (GPCR)
Mol. Mass.:
52852.05
Organism:
Rattus norvegicus (rat)
Description:
Rat cortex membranes 5-HT2A receptors.
Residue:
471
  
Inhibitor
Name:
BDBM50036434
Synonyms:
1-Allyl-4-dibenzo[b,f]oxepin-10-yl-1,2,3,6-tetrahydro-pyridine; hydrochloride | CHEMBL544418
Type:
Small organic molecule
Emp. Form.:
C22H21NO
Mol. Mass.:
315.4082
SMILES:
C=CCN1CCC(=CC1)C1=Cc2ccccc2Oc2ccccc12
: