Target
5-hydroxytryptamine receptor 2C
Ligand
BDBM50036434
Substrate
Meas. Tech.
ChEMBL_2814 (CHEMBL617843)
Ki
51±n/a nM
Citation
 Phillips, STde Paulis, TNeergaard, JRBaron, BMSiegel, BWSeeman, PVan Tol, HHGuan, HCSmith, HE Binding of 5H-dibenzo[a,d]cycloheptene and dibenz[b,f]oxepin analogues of clozapine to dopamine and serotonin receptors. J Med Chem 38:708-14 (1995)  
Target
Name:
5-hydroxytryptamine receptor 2C
Synonyms:
5-HT2C 5-hydroxytryptamine receptor 2C (5HT2c) 5ht1c Htr2c Serotonin receptor 2a and 2c (5HT2A and 5HT2C)
Type:
Enzyme
Mol. Mass.:
51935.10
Organism:
Rattus norvegicus (Rat)
Description:
P08909
Residue:
460
  
Inhibitor
Name:
BDBM50036434
Synonyms:
1-Allyl-4-dibenzo[b,f]oxepin-10-yl-1,2,3,6-tetrahydro-pyridine; hydrochloride | CHEMBL544418
Type:
Small organic molecule
Emp. Form.:
C22H21NO
Mol. Mass.:
315.4082
SMILES:
C=CCN1CCC(=CC1)C1=Cc2ccccc2Oc2ccccc12
: