Target
Dihydrofolate reductase
Ligand
BDBM50367055
Substrate
Meas. Tech.
ChEMBL_54287 (CHEMBL666806)
Ki
0.210000±n/a nM
Citation
 Rosowsky, AMota, CEQueener, SFWaltham, MErcikan-Abali, EBertino, JR 2,4-Diamino-5-substituted-quinazolines as inhibitors of a human dihydrofolate reductase with a site-directed mutation at position 22 and of the dihydrofolate reductases from Pneumocystis carinii and Toxoplasma gondii. J Med Chem 38:745-52 (1995)  
Target
Name:
Dihydrofolate reductase
Synonyms:
DHFR Dihydrofolate reductase (DHFR) | Tetrahydrofolate dehydrogenase
Type:
Enzyme
Mol. Mass.:
21453.99
Organism:
Homo sapiens (Human)
Description:
Recombinant human DHFR.
Residue:
187
  
Inhibitor
Name:
BDBM50367055
Synonyms:
4-Aminofolic acid AMINOPTERIN | Aminopteroylglutamic acid
Type:
Small organic molecule
Emp. Form.:
C19H20N8O5
Mol. Mass.:
440.4127
SMILES:
Nc1nc(N)c2nc(CNc3ccc(cc3)C(=O)N[C@@H](CCC(O)=O)C(O)=O)cnc2n1
: