Target
Dihydrofolate reductase
Ligand
BDBM50036484
Substrate
Meas. Tech.
ChEMBL_216591 (CHEMBL874093)
Ki
5.4±n/a nM
Citation
 Rosowsky, AMota, CEQueener, SFWaltham, MErcikan-Abali, EBertino, JR 2,4-Diamino-5-substituted-quinazolines as inhibitors of a human dihydrofolate reductase with a site-directed mutation at position 22 and of the dihydrofolate reductases from Pneumocystis carinii and Toxoplasma gondii. J Med Chem 38:745-52 (1995)  
Target
Name:
Dihydrofolate reductase
Synonyms:
DHFR Dihydrofolate reductase (DHFR) | Tetrahydrofolate dehydrogenase
Type:
Enzyme
Mol. Mass.:
21453.99
Organism:
Homo sapiens (Human)
Description:
Recombinant human DHFR.
Residue:
187
  
Inhibitor
Name:
BDBM50036484
Synonyms:
5-((E)-Styryl)-quinazoline-2,4-diamine | CHEMBL164845
Type:
Small organic molecule
Emp. Form.:
C16H14N4
Mol. Mass.:
262.3092
SMILES:
Nc1nc(N)c2c(\C=C\c3ccccc3)cccc2n1
: