Target
Dihydrofolate reductase
Ligand
BDBM50036483
Substrate
Meas. Tech.
ChEMBL_216591 (CHEMBL874093)
Ki
23±n/a nM
Citation
 Rosowsky, AMota, CEQueener, SFWaltham, MErcikan-Abali, EBertino, JR 2,4-Diamino-5-substituted-quinazolines as inhibitors of a human dihydrofolate reductase with a site-directed mutation at position 22 and of the dihydrofolate reductases from Pneumocystis carinii and Toxoplasma gondii. J Med Chem 38:745-52 (1995)  
Target
Name:
Dihydrofolate reductase
Synonyms:
DHFR Dihydrofolate reductase (DHFR) | Tetrahydrofolate dehydrogenase
Type:
Enzyme
Mol. Mass.:
21453.99
Organism:
Homo sapiens (Human)
Description:
Recombinant human DHFR.
Residue:
187
  
Inhibitor
Name:
BDBM50036483
Synonyms:
5-Phenethyl-quinazoline-2,4-diamine | CHEMBL341703
Type:
Small organic molecule
Emp. Form.:
C16H16N4
Mol. Mass.:
264.325
SMILES:
Nc1nc(N)c2c(CCc3ccccc3)cccc2n1
: