Target
Cholinesterase
Ligand
BDBM50034002
Substrate
Meas. Tech.
ChEMBL_41420 (CHEMBL654401)
IC50
3400±n/a nM
Citation
 Nagel, AAListon, DRJung, SMahar, MVincent, LAChapin, DChen, YLHubbard, SIves, JLJones, SB Design and synthesis of 1-heteroaryl-3-(1-benzyl-4-piperidinyl)propan-1-one derivatives as potent, selective acetylcholinesterase inhibitors. J Med Chem 38:1084-9 (1995)  
Target
Name:
Cholinesterase
Synonyms:
Acylcholine acylhydrolase Butyrylcholine esterase (BChE) Butyrylcholinesterase (BuChE) CHLE_HUMAN Cholinesterases Pseudocholinesterase
Type:
Homotetramer
Mol. Mass.:
68422.27
Organism:
Homo sapiens (Human)
Description:
P06276
Residue:
602
  
Inhibitor
Name:
BDBM50034002
Synonyms:
3-(1-Benzyl-piperidin-4-yl)-1-(2-methyl-benzothiazol-6-yl)-propan-1-one; hydrochloride CHEMBL542543
Type:
Small organic molecule
Emp. Form.:
C23H26N2OS
Mol. Mass.:
378.53
SMILES:
Cc1nc2ccc(cc2s1)C(=O)CCC1CCN(Cc2ccccc2)CC1
: