Target
D(3) dopamine receptor
Ligand
BDBM50407737
Substrate
Meas. Tech.
ChEMBL_62934 (CHEMBL673839)
Ki
15±n/a nM
Citation
 Sonesson, CBarf, TNilsson, JDijkstra, DCarlsson, ASvensson, KSmith, MWMartin, IJDuncan, JNKing, LJ Synthesis and evaluation of pharmacological and pharmacokinetic properties of monopropyl analogs of 5-, 7-, and 8-[[(trifluoromethyl)sulfonyl]oxy]-2-aminotetralins: central dopamine and serotonin receptor activity. J Med Chem 38:1319-29 (1995)  
Target
Name:
D(3) dopamine receptor
Synonyms:
DOPAMINE D3 DRD3_HUMAN Dopamine D3 receptor (D3) Dopamine receptor Dopamine receptor D3
Type:
Mol. Mass.:
44243.43
Organism:
Homo sapiens (Human)
Description:
Residue:
400
  
Inhibitor
Name:
BDBM50407737
Synonyms:
CHEMBL2021538
Type:
Small organic molecule
Emp. Form.:
C15H20F3NO2S
Mol. Mass.:
335.385
SMILES:
CCCN[C@H]1CCc2c(CS(=O)(=O)C(F)(F)F)cccc2C1
: