Target
Adenosine receptor A2a
Ligand
BDBM50369088
Substrate
Meas. Tech.
ChEMBL_30897 (CHEMBL645501)
EC50
227±n/a nM
Citation
 Cristalli, GCamaioni, EVittori, SVolpini, RBorea, PAConti, ADionisotti, SOngini, EMonopoli, A 2-Aralkynyl and 2-heteroalkynyl derivatives of adenosine-5'-N-ethyluronamide as selective A2a adenosine receptor agonists. J Med Chem 38:1462-72 (1995)  
Target
Name:
Adenosine receptor A2a
Synonyms:
AA2AR_RAT Adenosine A2 receptor Adenosine Receptors A2a (A2a) Adenosine receptors A2a Rat striatal adenosine A2a receptor
Type:
G Protein-Coupled Receptor (GPCR)
Mol. Mass.:
45015.65
Organism:
Rattus norvegicus (rat)
Description:
Rat A2A receptors expressed in CHO cells.
Residue:
410
  
Inhibitor
Name:
BDBM50369088
Synonyms:
CHEMBL604649
Type:
Small organic molecule
Emp. Form.:
C18H18N6O4S
Mol. Mass.:
414.438
SMILES:
CCNC(=O)[C@H]1OC([C@H](O)[C@@H]1O)n1cnc2c(N)nc(nc12)C#Cc1cccs1
: