Target
L-selectin
Ligand
BDBM50422136
Substrate
Meas. Tech.
ChEMBL_199999 (CHEMBL810688)
IC50
40000±n/a nM
Citation
 Wada, YSaito, TMatsuda, NOhmoto, HYoshino, KOhashi, MKondo, HIshida, HKiso, MHasegawa, A Studies on selectin blockers. 2. Novel selectin blocker as potential therapeutics for inflammatory disorders. J Med Chem 39:2055-9 (1996)  
Target
Name:
L-selectin
Synonyms:
LNHR LYAM1_HUMAN SELL | Selectin
Type:
PROTEIN
Mol. Mass.:
42187.20
Organism:
Homo sapiens (Human)
Description:
ChEMBL_200000
Residue:
372
  
Inhibitor
Name:
BDBM50422136
Synonyms:
CHEMBL2303852
Type:
Small organic molecule
Emp. Form.:
C61H112N2O22
Mol. Mass.:
1225.5422
SMILES:
CCCCCCCCCCCCCCC(CCCCCCCCCCCCCC)CO[C@@H]1O[C@@H](CO)[C@@H](O[C@@H]2O[C@@H](CO)[C@H](O)[C@H](OC(=O)C3CC(O)C(NC(C)=O)C(O3)C(O)C(O)CO)[C@@H]2O)[C@H](O[C@@H]2O[C@@H](C)[C@@H](O)[C@H](O)[C@@H]2O)[C@@H]1NC(C)=O
: