Target
Neuromedin-K receptor
Ligand
BDBM50051295
Substrate
Meas. Tech.
ChEMBL_209561 (CHEMBL808517)
Ki
4.2±n/a nM
Citation
 Giardina, GASarau, HMFarina, CMedhurst, ADGrugni, MFoley, JJRaveglia, LFSchmidt, DBRigolio, RVassallo, MVecchietti, VHay, DW 2-Phenyl-4-quinolinecarboxamides: a novel class of potent and selective non-peptide competitive antagonists for the human neurokinin-3 receptor. J Med Chem 39:2281-4 (1996)  
Target
Name:
Neuromedin-K receptor
Synonyms:
NK-3 receptor NK3R NKR Neurokinin B receptor Neuromedin-3 receptor (NK-3R) Neuromedin-K receptor Neuromedin-K receptor (NK3) TAC3R Tachykinin receptor 3 | Tachykinin receptor 3 (NK3)
Type:
Enzyme
Mol. Mass.:
52221.96
Organism:
Homo sapiens (Human)
Description:
P29371
Residue:
465
  
Inhibitor
Name:
BDBM50051295
Synonyms:
(S)-3-methyl-2-phenyl-N-(1-phenylpropyl)quinoline-4-carboxamide CHEMBL10284 | SB-222200
Type:
Small organic molecule
Emp. Form.:
C26H24N2O
Mol. Mass.:
380.4816
SMILES:
CC[C@H](NC(=O)c1c(C)c(nc2ccccc12)-c1ccccc1)c1ccccc1
: