Target
Glucagon receptor
Ligand
BDBM50407843
Substrate
Meas. Tech.
ChEMBL_70916 (CHEMBL684416)
IC50
395±n/a nM
Citation
 Azizeh, BYShenderovich, MDTrivedi, DLi, GSturm, NSHruby, VJ Topographical amino acid substitution in position 10 of glucagon leads to antagonists/partial agonists with greater binding differences. J Med Chem 39:2449-55 (1996)  
Target
Name:
Glucagon receptor
Synonyms:
GL-R Gcgr
Type:
PROTEIN
Mol. Mass.:
55053.40
Organism:
Rattus norvegicus
Description:
ChEMBL_1450588
Residue:
485
  
Inhibitor
Name:
BDBM50407843
Synonyms:
CHEMBL2114177
Type:
Small organic molecule
Emp. Form.:
C147H219N41O46S
Mol. Mass.:
3328.624
SMILES:
CSCC[C@H](NC(=O)[C@H](CC(C)C)NC(=O)[C@H](Cc1c[nH]c2ccccc12)NC(=O)[C@H](CCC(N)=O)NC(=O)[C@@H](NC(=O)[C@H](Cc1ccccc1)NC(=O)[C@H](CC(O)=O)NC(=O)[C@H](CCC(N)=O)NC(=O)[C@H](C)NC(=O)[C@H](CCCNC(N)=N)NC(=O)[C@H](CCCNC(N)=N)NC(=O)[C@H](CO)NC(=O)[C@H](CC(O)=O)NC(=O)[C@H](CC(C)C)NC(=O)[C@H](Cc1ccc(O)cc1)NC(=O)[C@H](CCCCN)NC(=O)[C@H](CO)NC(=O)[C@@H](C)NC(=O)[C@H](CCC(O)=O)NC(=O)[C@H](CO)NC(=O)[C@@H](NC(=O)[C@H](Cc1ccccc1)NC(=O)[C@H](Cc1ccc(O)cc1)NC(=O)CNC(=O)[C@H](CCC(N)=O)NC(=O)[C@@H](N)CO)[C@@H](C)O)C(C)C)C(=O)N[C@@H](CC(N)=O)C(=O)N[C@@H]([C@@H](C)O)C(N)=O
: