Target
Integrase
Ligand
BDBM24779
Substrate
Meas. Tech.
ChEMBL_90733 (CHEMBL701285)
IC50
>100000±n/a nM
Citation
 Mazumder, AWang, SNeamati, NNicklaus, MSunder, SChen, JMilne, GWRice, WGBurke, TRPommier, Y Antiretroviral agents as inhibitors of both human immunodeficiency virus type 1 integrase and protease. J Med Chem 39:2472-81 (1996)  
Target
Name:
Integrase
Synonyms:
Human immunodeficiency virus type 1 integrase
Type:
PROTEIN
Mol. Mass.:
32231.48
Organism:
Human immunodeficiency virus 1
Description:
ChEMBL_90865
Residue:
288
  
Inhibitor
Name:
BDBM24779
Synonyms:
2-Hydroxy-[1,4]naphthoquinone 2-hydroxy-1,4-naphthoquinone, 7 | CHEMBL42905
Type:
Small organic molecule
Emp. Form.:
C10H6O3
Mol. Mass.:
174.1528
SMILES:
O=C1CC(=O)c2ccccc2C1=O
: