Target
Integrase
Ligand
BDBM50051642
Substrate
Meas. Tech.
ChEMBL_90733 (CHEMBL701285)
IC50
90000±n/a nM
Citation
 Mazumder, AWang, SNeamati, NNicklaus, MSunder, SChen, JMilne, GWRice, WGBurke, TRPommier, Y Antiretroviral agents as inhibitors of both human immunodeficiency virus type 1 integrase and protease. J Med Chem 39:2472-81 (1996)  
Target
Name:
Integrase
Synonyms:
Human immunodeficiency virus type 1 integrase
Type:
PROTEIN
Mol. Mass.:
32231.48
Organism:
Human immunodeficiency virus 1
Description:
ChEMBL_90865
Residue:
288
  
Inhibitor
Name:
BDBM50051642
Synonyms:
2-[3,4-dichlorophenyl(3-hydroxy-1,4-dioxo-1,4-dihydro-2-naphthalenyl)methyl]-3-hydroxy-1,4-dihydro-1,4-naphthalenedione NSC-117275
Type:
Small organic molecule
Emp. Form.:
C27H14Cl2O6
Mol. Mass.:
505.302
SMILES:
Oc1c(O)c2ccccc2c(O)c1C(=C1C(=O)C(=O)c2ccccc2C1=O)c1ccc(Cl)c(Cl)c1
: