Target
Integrase
Ligand
BDBM50051640
Substrate
Meas. Tech.
ChEMBL_90733 (CHEMBL701285)
IC50
>100000±n/a nM
Citation
 Mazumder, AWang, SNeamati, NNicklaus, MSunder, SChen, JMilne, GWRice, WGBurke, TRPommier, Y Antiretroviral agents as inhibitors of both human immunodeficiency virus type 1 integrase and protease. J Med Chem 39:2472-81 (1996)  
Target
Name:
Integrase
Synonyms:
Human immunodeficiency virus type 1 integrase
Type:
PROTEIN
Mol. Mass.:
32231.48
Organism:
Human immunodeficiency virus 1
Description:
ChEMBL_90865
Residue:
288
  
Inhibitor
Name:
BDBM50051640
Synonyms:
4-Hydroxy-3-(4-hydroxy-2-oxo-chroman-3-ylmethyl)-chromen-2-one NSC-41834
Type:
Small organic molecule
Emp. Form.:
C19H14O6
Mol. Mass.:
338.3109
SMILES:
OC1C(Cc2c(O)c3ccccc3oc2=O)C(=O)Oc2ccccc12
: