Target
Neprilysin
Ligand
BDBM50051803
Substrate
Meas. Tech.
ChEMBL_144459 (CHEMBL755106)
IC50
1.2±n/a nM
Citation
 Fournie-Zaluski, MCCoric, PThery, VGonzalez, WMeudal, HTurcaud, SMichel, JBRoques, BP Design of orally active dual inhibitors of neutral endopeptidase and angiotensin-converting enzyme with long duration of action. J Med Chem 39:2594-608 (1996)  
Target
Name:
Neprilysin
Synonyms:
Atriopeptidase CD_antigen=CD10 MME NEP_RABIT Neutral endopeptidase 24.11
Type:
Enzyme
Mol. Mass.:
85570.75
Organism:
Oryctolagus cuniculus (rabbit)
Description:
NEP was purified to homogeneity from rabbit kidney.
Residue:
750
  
Inhibitor
Name:
BDBM50051803
Synonyms:
(2S,5R)-1-{2-[3-(4-Chloro-phenyl)-2-mercapto-propionylamino]-acetyl}-5-(2-hydroxy-phenyl)-pyrrolidine-2-carboxylic acid | CHEMBL327454
Type:
Small organic molecule
Emp. Form.:
C22H23ClN2O5S
Mol. Mass.:
462.946
SMILES:
OC(=O)[C@@H]1CC[C@@H](N1C(=O)CNC(=O)C(S)Cc1ccc(Cl)cc1)c1ccccc1O
: