Target
Leukotriene B4 receptor 1
Ligand
BDBM50052021
Substrate
Meas. Tech.
ChEMBL_99851 (CHEMBL706922)
IC50
4±n/a nM
Citation
 Brooks, CDSummers, JB Modulators of leukotriene biosynthesis and receptor activation. J Med Chem 39:2629-54 (1996)  
Target
Name:
Leukotriene B4 receptor 1
Synonyms:
BLT BLTR Chemoattractant receptor-like 1 GPR16 LTB4-R 1 Leukotriene B4 R1 Leukotriene B4 receptor 1 P2Y purinoceptor 7 | P2Y7
Type:
Enzyme Catalytic Domain
Mol. Mass.:
37582.68
Organism:
Homo sapiens (Human)
Description:
Q15722
Residue:
352
  
Inhibitor
Name:
BDBM50052021
Synonyms:
4-[5-(4-Carbamimidoyl-phenoxy)-pentyloxy]-N,N-diisopropyl-3-methoxy-benzamide CHEMBL89326
Type:
Small organic molecule
Emp. Form.:
C26H37N3O4
Mol. Mass.:
455.5897
SMILES:
COc1cc(ccc1OCCCCCOc1ccc(cc1)C(N)=N)C(=O)N(C(C)C)C(C)C
: