Target
Transient receptor potential cation channel subfamily V member 1
Ligand
BDBM50052320
Substrate
Meas. Tech.
ChEMBL_215635 (CHEMBL820953)
Ki
1±n/a nM
Citation
 Walpole, CSBevan, SBloomfield, GBreckenridge, RJames, IFRitchie, TSzallasi, AWinter, JWrigglesworth, R Similarities and differences in the structure-activity relationships of capsaicin and resiniferatoxin analogues. J Med Chem 39:2939-52 (1996)  
Target
Name:
Transient receptor potential cation channel subfamily V member 1
Synonyms:
Capsaicin receptor TRPV1_RAT Trpv1 Vanilloid VR1 Vanilloid receptor 1 (VRI/TRPV1) Vanilloid receptor type 1-like (TrpV1/Vr1) Vr1l | osm-9-like TRP channel 1
Type:
Transient Receptor
Mol. Mass.:
94956.12
Organism:
Rattus norvegicus (rat)
Description:
O35433
Residue:
838
  
Inhibitor
Name:
BDBM50052320
Synonyms:
13-benzyl-6-hydroxy-15-isopropenyl-4,17-dimethyl-5-oxo-(1R,2S,6R,10S,11R,15R,17R)-12,14,18-trioxapentacyclo[11.4.1.01,10.02,6.011,15]octadeca-3,8-dien-8-ylmethyl 2-(3,4-dimethoxyphenyl)acetate | CHEMBL319214
Type:
Small organic molecule
Emp. Form.:
C38H42O9
Mol. Mass.:
642.7347
SMILES:
COc1ccc(CC(=O)OCC2=C[C@H]3C4OC5(Cc6ccccc6)O[C@@]4(C[C@@H](C)C3(O5)[C@@H]3C=C(C)C(=O)[C@@]3(O)C2)C(C)=C)cc1OC
: