Target
Metabotropic glutamate receptor 1
Ligand
BDBM26431
Substrate
Meas. Tech.
ChEMBL_105864 (CHEMBL717333)
EC50
>1000000±n/a nM
Citation
 Bräuner-Osborne, HSløk, FASkjaerbaek, NEbert, BSekiyama, NNakanishi, SKrogsgaard-Larsen, P A new highly selective metabotropic excitatory amino acid agonist: 2-amino-4-(3-hydroxy-5-methylisoxazol-4-yl)butyric acid. J Med Chem 39:3188-94 (1996)  
Target
Name:
Metabotropic glutamate receptor 1
Synonyms:
GPRC1A GRM1_HUMAN Metabotropic Glutamate 1a | metabotropic glutamate 1
Type:
Enzyme
Mol. Mass.:
132358.19
Organism:
Homo sapiens (Human)
Description:
Q13255
Residue:
1194
  
Inhibitor
Name:
BDBM26431
Synonyms:
(2R)-2-aminopentanedioic acid D-Glu D-[14C]Glu
Type:
radiolabeled amino acid
Emp. Form.:
C5H9NO4
Mol. Mass.:
147.1293
SMILES:
N[C@H](CCC(O)=O)C(O)=O
: