Target
Penicillin-binding protein, transpeptidase domain protein
Ligand
BDBM50053180
Substrate
Meas. Tech.
ChEMBL_153671 (CHEMBL757153)
IC50
286000±n/a nM
Citation
 Richter, HGAngehrn, PHubschwerlen, CKania, MPage, MGSpecklin, JLWinkler, FK Design, synthesis, and evaluation of 2 beta-alkenyl penam sulfone acids as inhibitors of beta-lactamases. J Med Chem 39:3712-22 (1996)  
Target
Name:
Penicillin-binding protein, transpeptidase domain protein
Synonyms:
Penicillin-binding protein | Penicillin-binding protein 2b
Type:
PROTEIN
Mol. Mass.:
77257.38
Organism:
Staphylococcus aureus
Description:
ChEMBL_153668
Residue:
691
  
Inhibitor
Name:
BDBM50053180
Synonyms:
CHEMBL332565 | Sodium; (2S,3S,5R)-3-methyl-4,4,7-trioxo-3-((Z)-2-thiazol-5-yl-vinyl)-4lambda*6*-thia-1-aza-bicyclo[3.2.0]heptane-2-carboxylate
Type:
Small organic molecule
Emp. Form.:
C12H11N2O5S2
Mol. Mass.:
327.357
SMILES:
C[C@]1(\C=C/c2cncs2)[C@@H](N2[C@@H](CC2=O)S1(=O)=O)C([O-])=O
: