Target
Beta-lactamase
Ligand
BDBM50407935
Substrate
Meas. Tech.
ChEMBL_41030 (CHEMBL651934)
IC50
4900±n/a nM
Citation
 Richter, HGAngehrn, PHubschwerlen, CKania, MPage, MGSpecklin, JLWinkler, FK Design, synthesis, and evaluation of 2 beta-alkenyl penam sulfone acids as inhibitors of beta-lactamases. J Med Chem 39:3712-22 (1996)  
Target
Name:
Beta-lactamase
Synonyms:
AMPC_ENTCL | ampC
Type:
PROTEIN
Mol. Mass.:
41306.67
Organism:
Enterobacter cloacae
Description:
ChEMBL_40258
Residue:
381
  
Inhibitor
Name:
BDBM50407935
Synonyms:
CHEMBL2111804
Type:
Small organic molecule
Emp. Form.:
C10H12N2O6S
Mol. Mass.:
288.277
SMILES:
C[C@]1(\C=C\C(N)=O)[C@@H](N2[C@@H](CC2=O)S1(=O)=O)C(O)=O
: