Target
Beta-lactamase
Ligand
BDBM50053185
Substrate
Meas. Tech.
ChEMBL_40258 (CHEMBL656488)
IC50
480±n/a nM
Citation
 Richter, HGAngehrn, PHubschwerlen, CKania, MPage, MGSpecklin, JLWinkler, FK Design, synthesis, and evaluation of 2 beta-alkenyl penam sulfone acids as inhibitors of beta-lactamases. J Med Chem 39:3712-22 (1996)  
Target
Name:
Beta-lactamase
Synonyms:
AMPC_ENTCL | ampC
Type:
PROTEIN
Mol. Mass.:
41306.67
Organism:
Enterobacter cloacae
Description:
ChEMBL_40258
Residue:
381
  
Inhibitor
Name:
BDBM50053185
Synonyms:
(2S,3S,5R)-3-((E)-3-Carbamoyloxy-propenyl)-3-methyl-4,4,7-trioxo-4lambda*6*-thia-1-aza-bicyclo[3.2.0]heptane-2-carboxylic acid | CHEMBL123029
Type:
Small organic molecule
Emp. Form.:
C11H14N2O7S
Mol. Mass.:
318.303
SMILES:
C[C@]1(\C=C\COC(N)=O)[C@@H](N2[C@@H](CC2=O)S1(=O)=O)C(O)=O
: