Target
Beta-lactamase
Ligand
BDBM50076680
Substrate
Meas. Tech.
ChEMBL_41017 (CHEMBL655035)
IC50
380±n/a nM
Citation
 Richter, HGAngehrn, PHubschwerlen, CKania, MPage, MGSpecklin, JLWinkler, FK Design, synthesis, and evaluation of 2 beta-alkenyl penam sulfone acids as inhibitors of beta-lactamases. J Med Chem 39:3712-22 (1996)  
Target
Name:
Beta-lactamase
Synonyms:
AMPC_PSEAE beta-Lactamase
Type:
Enzyme
Mol. Mass.:
43406.87
Organism:
Pseudomonas aeruginosa (PAO1)
Description:
P24735
Residue:
397
  
Inhibitor
Name:
BDBM50076680
Synonyms:
CHEMBL6461 Sodium; (2S,3R,5R)-3-((Z)-2-cyano-vinyl)-3-methyl-4,4,7-trioxo-4lambda*6*-thia-1-aza-bicyclo[3.2.0]heptane-2-carboxylate | Sodium; (2S,3S,5R)-3-((Z)-2-cyano-vinyl)-3-methyl-4,4,7-trioxo-4lambda*6*-thia-1-aza-bicyclo[3.2.0]heptane-2-carboxylate
Type:
Small organic molecule
Emp. Form.:
C10H9N2O5S
Mol. Mass.:
269.254
SMILES:
C[C@]1(\C=C\C#N)[C@@H](N2[C@@H](CC2=O)S1(=O)=O)C([O-])=O
: