Target
Sodium-dependent serotonin transporter
Ligand
BDBM50451132
Substrate
Meas. Tech.
ChEMBL_201996 (CHEMBL809441)
Ki
181±n/a nM
Citation
 Neumeyer, JLTamagnan, GWang, SGao, YMilius, RAKula, NSBaldessarini, RJ N-substituted analogs of 2 beta-carbomethoxy-3 beta- (4'-iodophenyl)tropane (beta-CIT) with selective affinity to dopamine or serotonin transporters in rat forebrain. J Med Chem 39:543-8 (1996)  
Target
Name:
Sodium-dependent serotonin transporter
Synonyms:
5-HT Transporter 5HT transporter Anandamid membrane transporter, AMT Monoamine transporters; Norepinephrine & serotonin Slc6a4 Sodium-dependent serotonin transporter (SERT) | imipramine receptor
Type:
Multi-pass membrane protein
Mol. Mass.:
70168.43
Organism:
Rattus norvegicus (rat)
Description:
P31652
Residue:
630
  
Inhibitor
Name:
BDBM50451132
Synonyms:
CHEMBL2079586 | WIN-35428
Type:
Small organic molecule
Emp. Form.:
C16H20FNO2
Mol. Mass.:
277.3339
SMILES:
[H][C@@]12CC[C@]([H])([C@H]([C@H](C1)c1ccc(F)cc1)C(=O)OC)N2C
: