Target
Polyunsaturated fatty acid 5-lipoxygenase
Ligand
BDBM50053529
Substrate
Meas. Tech.
ChEMBL_3826 (CHEMBL618012)
IC50
50±n/a nM
Citation
 Delorme, DDucharme, YBrideau, CChan, CCChauret, NDesmarais, SDubé, DFalgueyret, JPFortin, RGuay, JHamel, PJones, TRLépine, CLi, CMcAuliffe, MMcFarlane, CSNicoll-Griffith, DARiendeau, DYergey, JAGirard, Y Dioxabicyclooctanyl naphthalenenitriles as nonredox 5-lipoxygenase inhibitors: structure-activity relationship study directed toward the improvement of metabolic stability. J Med Chem 39:3951-70 (1996)  
Target
Name:
Polyunsaturated fatty acid 5-lipoxygenase
Synonyms:
5-LO 5-Lipoxygenase (5-LO) 5-Lipoygenase ALOX5 LOG5 | LOX5_HUMAN
Type:
Enzyme
Mol. Mass.:
77972.74
Organism:
Homo sapiens (Human)
Description:
Recombinant protein was purified from E. coli lysate. After ammonium sulfate precipitation and subsequent steps, the supernatant (S100) was used for 5-LO activity assay.
Residue:
674
  
Inhibitor
Name:
BDBM50053529
Synonyms:
CHEMBL127779 | {4-Furan-3-yl-7-[3-(4-hydroxy-tetrahydro-pyran-4-yl)-benzyloxy]-naphthalen-2-yl}-thiazol-2-yl-methanone
Type:
Small organic molecule
Emp. Form.:
C30H25NO5S
Mol. Mass.:
511.588
SMILES:
OC1(CCOCC1)c1cccc(COc2ccc3c(cc(cc3c2)C(=O)c2nccs2)-c2ccoc2)c1
: