Target
Sodium-dependent serotonin transporter
Ligand
BDBM50366600
Substrate
Meas. Tech.
ChEMBL_201655 (CHEMBL806555)
IC50
127±n/a nM
Citation
 Blough, BEAbraham, PLewin, AHKuhar, MJBoja, JWCarroll, FI Synthesis and transporter binding properties of 3 beta-(4'-alkyl-, 4'-alkenyl-, and 4'-alkynylphenyl)nortropane-2 beta-carboxylic acid methyl esters: serotonin transporter selective analogs. J Med Chem 39:4027-35 (1996)  
Target
Name:
Sodium-dependent serotonin transporter
Synonyms:
5-HT Transporter 5HT transporter Anandamid membrane transporter, AMT Monoamine transporters; Norepinephrine & serotonin Slc6a4 Sodium-dependent serotonin transporter (SERT) | imipramine receptor
Type:
Multi-pass membrane protein
Mol. Mass.:
70168.43
Organism:
Rattus norvegicus (rat)
Description:
P31652
Residue:
630
  
Inhibitor
Name:
BDBM50366600
Synonyms:
CHEMBL301281
Type:
Small organic molecule
Emp. Form.:
C16H19NO4
Mol. Mass.:
289.3264
SMILES:
COC(=O)[C@@H]1C2CCC(C[C@@H]1OC(=O)c1ccccc1)N2
: