Target
Sodium-dependent serotonin transporter
Ligand
BDBM50053645
Substrate
Meas. Tech.
ChEMBL_201655 (CHEMBL806555)
IC50
7.1±n/a nM
Citation
 Blough, BEAbraham, PLewin, AHKuhar, MJBoja, JWCarroll, FI Synthesis and transporter binding properties of 3 beta-(4'-alkyl-, 4'-alkenyl-, and 4'-alkynylphenyl)nortropane-2 beta-carboxylic acid methyl esters: serotonin transporter selective analogs. J Med Chem 39:4027-35 (1996)  
Target
Name:
Sodium-dependent serotonin transporter
Synonyms:
5-HT Transporter 5HT transporter Anandamid membrane transporter, AMT Monoamine transporters; Norepinephrine & serotonin Slc6a4 Sodium-dependent serotonin transporter (SERT) | imipramine receptor
Type:
Multi-pass membrane protein
Mol. Mass.:
70168.43
Organism:
Rattus norvegicus (rat)
Description:
P31652
Residue:
630
  
Inhibitor
Name:
BDBM50053645
Synonyms:
8-Methyl-3-[((Z)-4-propenyl)-phenyl]-8-aza-bicyclo[3.2.1]octane-2-carboxylic acid methyl ester | CHEMBL335001
Type:
Small organic molecule
Emp. Form.:
C19H25NO2
Mol. Mass.:
299.4073
SMILES:
COC(=O)C1C2CCC(CC1c1ccc(\C=C/C)cc1)N2C
: