Target
Sodium-dependent dopamine transporter
Ligand
BDBM50053651
Substrate
Meas. Tech.
ChEMBL_62011 (CHEMBL671633)
IC50
2.4±n/a nM
Citation
 Blough, BEAbraham, PLewin, AHKuhar, MJBoja, JWCarroll, FI Synthesis and transporter binding properties of 3 beta-(4'-alkyl-, 4'-alkenyl-, and 4'-alkynylphenyl)nortropane-2 beta-carboxylic acid methyl esters: serotonin transporter selective analogs. J Med Chem 39:4027-35 (1996)  
Target
Name:
Sodium-dependent dopamine transporter
Synonyms:
DA transporter SC6A3_RAT Sodium-dependent dopamine transporter | Sodium-dependent dopamine transporter (DAT)
Type:
Multi-pass membrane protein
Mol. Mass.:
68749.45
Organism:
Rattus norvegicus (rat)
Description:
P23977
Residue:
619
  
Inhibitor
Name:
BDBM50053651
Synonyms:
8-Methyl-3-(4-prop-1-ynyl-phenyl)-8-aza-bicyclo[3.2.1]octane-2-carboxylic acid methyl ester | CHEMBL127557
Type:
Small organic molecule
Emp. Form.:
C19H23NO2
Mol. Mass.:
297.3914
SMILES:
COC(=O)C1C2CCC(CC1c1ccc(cc1)C#CC)N2C
: