Target
Transporter
Ligand
BDBM50053653
Substrate
Meas. Tech.
ChEMBL_142960 (CHEMBL750812)
IC50
15±n/a nM
Citation
 Blough, BEAbraham, PLewin, AHKuhar, MJBoja, JWCarroll, FI Synthesis and transporter binding properties of 3 beta-(4'-alkyl-, 4'-alkenyl-, and 4'-alkynylphenyl)nortropane-2 beta-carboxylic acid methyl esters: serotonin transporter selective analogs. J Med Chem 39:4027-35 (1996)  
Target
Name:
Transporter
Synonyms:
Monoamine transporters; Norepininephrine & dopamine | Norepinephrine Monoamine transporters
Type:
PROTEIN
Mol. Mass.:
66787.87
Organism:
Rattus norvegicus
Description:
ChEMBL_1463061
Residue:
597
  
Inhibitor
Name:
BDBM50053653
Synonyms:
3-(4-Vinyl-phenyl)-8-aza-bicyclo[3.2.1]octane-2-carboxylic acid methyl ester | CHEMBL132513
Type:
Small organic molecule
Emp. Form.:
C17H21NO2
Mol. Mass.:
271.3541
SMILES:
COC(=O)C1C2CCC(CC1c1ccc(C=C)cc1)N2
: