Target
Sodium-dependent dopamine transporter
Ligand
BDBM50010195
Substrate
Meas. Tech.
ChEMBL_61848 (CHEMBL670035)
IC50
1.3±n/a nM
Citation
 Holmquist, CRKeverline-Frantz, KIAbraham, PBoja, JWKuhar, MJCarroll, FI 3 alpha-(4'-substituted phenyl)tropane-2 beta-carboxylic acid methyl esters: novel ligands with high affinity and selectivity at the dopamine transporter. J Med Chem 39:4139-41 (1996)  
Target
Name:
Sodium-dependent dopamine transporter
Synonyms:
DA transporter SC6A3_RAT Sodium-dependent dopamine transporter | Sodium-dependent dopamine transporter (DAT)
Type:
Multi-pass membrane protein
Mol. Mass.:
68749.45
Organism:
Rattus norvegicus (rat)
Description:
P23977
Residue:
619
  
Inhibitor
Name:
BDBM50010195
Synonyms:
(3S,5R)-methyl 3-(4-iodophenyl)-8-methyl-8-aza-bicyclo[3.2.1]octane-2-carboxylate 3-(4-Iodo-phenyl)-8-methyl-8-aza-bicyclo[3.2.1]octane-2-carboxylic acid methyl ester | CHEMBL14391
Type:
Small organic molecule
Emp. Form.:
C16H20INO2
Mol. Mass.:
385.24
SMILES:
COC(=O)C1C2CCC(CC1c1ccc(I)cc1)N2C
: