Target
Adenosine receptor A1
Ligand
BDBM50369168
Substrate
Meas. Tech.
ChEMBL_28389 (CHEMBL875517)
EC50
>1±n/a nM
Citation
 Vittori, SCamaioni, EDi Francesco, EVolpini, RMonopoli, ADionisotti, SOngini, ECristalli, G 2-alkenyl and 2-alkyl derivatives of adenosine and adenosine-5'-N-ethyluronamide: different affinity and selectivity of E- and Z-diastereomers at A2A adenosine receptors. J Med Chem 39:4211-7 (1996)  
Target
Name:
Adenosine receptor A1
Synonyms:
AA1R_RAT ADENOSINE A1 high Adenosine A1 receptor (A1) Adenosine receptors A1 | Adora1
Type:
Protein
Mol. Mass.:
36704.13
Organism:
Rattus norvegicus (rat)
Description:
Residue:
326
  
Inhibitor
Name:
BDBM50369168
Synonyms:
CHEMBL608918
Type:
Small organic molecule
Emp. Form.:
C16H25N5O4
Mol. Mass.:
351.4008
SMILES:
CCCCCCc1nc(N)c2ncn(C3O[C@H](CO)[C@@H](O)[C@H]3O)c2n1
: