Target
D(4) dopamine receptor
Ligand
BDBM50054064
Substrate
Meas. Tech.
ChEMBL_61153 (CHEMBL670689)
Ki
>3333±n/a nM
Citation
 van Vliet, LATepper, PGDijkstra, DDamsma, GWikström, HPugsley, TAAkunne, HCHeffner, TGGlase, SAWise, LD Affinity for dopamine D2, D3, and D4 receptors of 2-aminotetralins. Relevance of D2 agonist binding for determination of receptor subtype selectivity. J Med Chem 39:4233-7 (1996)  
Target
Name:
D(4) dopamine receptor
Synonyms:
D(2C) dopamine receptor DOPAMINE D4.2 DRD4 Dopamine D4 receptor
Type:
Enzyme
Mol. Mass.:
48373.19
Organism:
Homo sapiens (Human)
Description:
P21917
Residue:
419
  
Inhibitor
Name:
BDBM50054064
Synonyms:
((S)-7-Methoxy-1,2,3,4-tetrahydro-naphthalen-2-yl)-propyl-amine | CHEMBL336962
Type:
Small organic molecule
Emp. Form.:
C14H21NO
Mol. Mass.:
219.3226
SMILES:
CCCN[C@H]1CCc2ccc(OC)cc2C1
: