Target
D(2) dopamine receptor
Ligand
BDBM50054121
Substrate
Meas. Tech.
ChEMBL_62385 (CHEMBL672338)
Ki
>10000±n/a nM
Citation
 Berardi, FGiudice, GPerrone, RTortorella, VGovoni, SLucchi, L Novel potent sigma 1 ligands: N-[omega-(tetralin-1-yl)alkyl]piperidine derivatives. J Med Chem 39:4255-60 (1996)  
Target
Name:
D(2) dopamine receptor
Synonyms:
DOPAMINE D2 DOPAMINE D2 Short Dopamine D2 receptor Drd2
Type:
G Protein-Coupled Receptor (GPCR)
Mol. Mass.:
50931.60
Organism:
Rattus norvegicus (rat)
Description:
P61169
Residue:
444
  
Inhibitor
Name:
BDBM50054121
Synonyms:
3,3-Dimethyl-1-[4-(1,2,3,4-tetrahydro-naphthalen-1-yl)-butyl]-piperidine | CHEMBL128442
Type:
Small organic molecule
Emp. Form.:
C21H33N
Mol. Mass.:
299.4934
SMILES:
CC1(C)CCCN(CCCCC2CCCc3ccccc23)C1
: