Target
D(2) dopamine receptor
Ligand
BDBM50366495
Substrate
Meas. Tech.
ChEMBL_62385 (CHEMBL672338)
Ki
0.30±n/a nM
Citation
 Berardi, FGiudice, GPerrone, RTortorella, VGovoni, SLucchi, L Novel potent sigma 1 ligands: N-[omega-(tetralin-1-yl)alkyl]piperidine derivatives. J Med Chem 39:4255-60 (1996)  
Target
Name:
D(2) dopamine receptor
Synonyms:
DOPAMINE D2 DOPAMINE D2 Short Dopamine D2 receptor Drd2
Type:
G Protein-Coupled Receptor (GPCR)
Mol. Mass.:
50931.60
Organism:
Rattus norvegicus (rat)
Description:
P61169
Residue:
444
  
Inhibitor
Name:
BDBM50366495
Synonyms:
(+)butaclamol | CHEMBL1255588
Type:
Small organic molecule
Emp. Form.:
C25H31NO
Mol. Mass.:
361.5197
SMILES:
CC(C)(C)[C@@]1(O)CCN2C[C@@H]3c4ccccc4CCc4cccc([C@H]2C1)c34
: