Target
Bifunctional dihydrofolate reductase-thymidylate synthase
Ligand
BDBM50054512
Substrate
Meas. Tech.
ChEMBL_53308 (CHEMBL662240)
IC50
3100±n/a nM
Citation
 Gangjee, AMavandadi, FKisliuk, RLMcGuire, JJQueener, SF 2-amino-4-oxo-5-substituted-pyrrolo[2,3-d]pyrimidines as nonclassical antifolate inhibitors of thymidylate synthase. J Med Chem 39:4563-8 (1996)  
Target
Name:
Bifunctional dihydrofolate reductase-thymidylate synthase
Synonyms:
DHFR-TS Dihydrofolate reductase Dihydrofolate reductase; T. gondii vs rat
Type:
Enzyme
Mol. Mass.:
68757.49
Organism:
Toxoplasma gondii
Description:
Q07422
Residue:
610
  
Inhibitor
Name:
BDBM50054512
Synonyms:
2-Amino-5-(4-chloro-phenylsulfanyl)-6-methyl-3,7-dihydro-pyrrolo[2,3-d]pyrimidin-4-one | CHEMBL142176
Type:
Small organic molecule
Emp. Form.:
C13H11ClN4OS
Mol. Mass.:
306.771
SMILES:
Cc1[nH]c2nc(N)[nH]c(=O)c2c1Sc1ccc(Cl)cc1
: