Target
Thymidylate synthase
Ligand
BDBM18808
Substrate
Meas. Tech.
ChEMBL_209626 (CHEMBL816742)
IC50
130±n/a nM
Citation
 Gangjee, AMavandadi, FKisliuk, RLMcGuire, JJQueener, SF 2-amino-4-oxo-5-substituted-pyrrolo[2,3-d]pyrimidines as nonclassical antifolate inhibitors of thymidylate synthase. J Med Chem 39:4563-8 (1996)  
Target
Name:
Thymidylate synthase
Synonyms:
TS TYMS Thymidylate synthase (TS) | Thymidylate synthase/GAR transformylase/AICAR transformylase
Type:
Enzyme
Mol. Mass.:
35718.07
Organism:
Homo sapiens (Human)
Description:
Residue:
313
  
Inhibitor
Name:
BDBM18808
Synonyms:
2-amino-5-[(3,4-dichlorophenyl)sulfanyl]-6-methyl-3H,4H,7H-pyrrolo[2,3-d]pyrimidin-4-one Pyrrolo[2,3-d]pyrimidine analogue, 3
Type:
Small organic molecule
Emp. Form.:
C13H10Cl2N4OS
Mol. Mass.:
341.216
SMILES:
Cc1[nH]c2nc(N)[nH]c(=O)c2c1Sc1ccc(Cl)c(Cl)c1
: