Target
Adenosine receptor A3
Ligand
BDBM50054679
Substrate
Meas. Tech.
ChEMBL_31859 (CHEMBL643936)
Ki
72±n/a nM
Citation
 Jiang, JLvan Rhee, AMMelman, NJi, XDJacobson, KA 6-phenyl-1,4-dihydropyridine derivatives as potent and selective A3 adenosine receptor antagonists. J Med Chem 39:4667-75 (1996)  
Target
Name:
Adenosine receptor A3
Synonyms:
A3 adenosine receptor (hA3) ADORA3 | Adenosine A3 receptor (A3AR)
Type:
G Protein-Coupled Receptor (GPCR)
Mol. Mass.:
36197.32
Organism:
Homo sapiens (Human)
Description:
P0DMS8
Residue:
318
  
Inhibitor
Name:
BDBM50054679
Synonyms:
2-Methyl-4-[(E)-2-(4-nitro-phenyl)-vinyl]-6-phenyl-1,4-dihydro-pyridine-3,5-dicarboxylic acid 5-benzyl ester 3-ethyl ester | CHEMBL357837
Type:
Small organic molecule
Emp. Form.:
C31H28N2O6
Mol. Mass.:
524.5638
SMILES:
CCOC(=[OH+])C1=C(C)N=C(\C(C1\C=C\c1ccc(cc1)[N+]([O-])=O)=C(\[O-])OCc1ccccc1)c1ccccc1
: