Target
Adenosine receptor A3
Ligand
BDBM85775
Substrate
Meas. Tech.
ChEMBL_31254 (CHEMBL640399)
Ki
108±n/a nM
Citation
 Jiang, JLvan Rhee, AMMelman, NJi, XDJacobson, KA 6-phenyl-1,4-dihydropyridine derivatives as potent and selective A3 adenosine receptor antagonists. J Med Chem 39:4667-75 (1996)  
Target
Name:
Adenosine receptor A3
Synonyms:
A3 adenosine receptor (hA3) ADORA3 | Adenosine A3 receptor (A3AR)
Type:
G Protein-Coupled Receptor (GPCR)
Mol. Mass.:
36197.32
Organism:
Homo sapiens (Human)
Description:
P0DMS8
Residue:
318
  
Inhibitor
Name:
BDBM85775
Synonyms:
CHEMBL315984 | MRS1097
Type:
Small organic molecule
Emp. Form.:
C26H27NO4
Mol. Mass.:
417.4969
SMILES:
CCOC(=O)C1C(\C=C\c2ccccc2)C(C(=O)OCC)=C(N=C1C)c1ccccc1
: