Target
Proteinase-activated receptor 1
Ligand
BDBM50054892
Substrate
Meas. Tech.
ChEMBL_209254 (CHEMBL815695)
IC50
18000±n/a nM
Citation
 Bernatowicz, MSKlimas, CEHartl, KSPeluso, MAllegretto, NJSeiler, SM Development of potent thrombin receptor antagonist peptides. J Med Chem 39:4879-87 (1997)  
Target
Name:
Proteinase-activated receptor 1
Synonyms:
CF2R F2R PAR1 Proteinase activated receptor 1 TR Thrombin receptor/ Proteinase-activated receptor 1(Par-1)
Type:
Protein
Mol. Mass.:
47450.07
Organism:
Homo sapiens (Human)
Description:
P25116
Residue:
425
  
Inhibitor
Name:
BDBM50054892
Synonyms:
2-[2-{Acetyl-[(E)-(3-phenyl-acryloyl)]-amino}-3-(4-fluoro-phenyl)-propionylamino]-6-amino-hexanoic acid [1-(1-carbamoyl-4-guanidino-butylcarbamoyl)-3-methyl-butyl]-amide | CHEMBL144608
Type:
Small organic molecule
Emp. Form.:
C38H54FN9O6
Mol. Mass.:
751.8905
SMILES:
CC(C)CC(NC(=O)C(CCCCN)NC(=O)C(Cc1ccc(F)cc1)N(C(C)=O)C(=O)C=Cc1ccccc1)C(=O)NC(CCCNC(N)=N)C(N)=O
: