Target
Proteinase-activated receptor 1
Ligand
BDBM50054884
Substrate
Meas. Tech.
ChEMBL_209251 (CHEMBL815692)
IC50
1180±n/a nM
Citation
 Bernatowicz, MSKlimas, CEHartl, KSPeluso, MAllegretto, NJSeiler, SM Development of potent thrombin receptor antagonist peptides. J Med Chem 39:4879-87 (1997)  
Target
Name:
Proteinase-activated receptor 1
Synonyms:
CF2R F2R PAR1 Proteinase activated receptor 1 TR Thrombin receptor/ Proteinase-activated receptor 1(Par-1)
Type:
Protein
Mol. Mass.:
47450.07
Organism:
Homo sapiens (Human)
Description:
P25116
Residue:
425
  
Inhibitor
Name:
BDBM50054884
Synonyms:
2-[2-[2-{Acetyl-[(E)-(3-phenyl-acryloyl)]-amino}-3-(4-fluoro-phenyl)-propionylamino]-3-(4-methoxy-phenyl)-propionylamino]-4-methyl-pentanoic acid (1-carbamoyl-4-guanidino-butyl)-amide | CHEMBL344728
Type:
Small organic molecule
Emp. Form.:
C42H53FN8O7
Mol. Mass.:
800.918
SMILES:
COc1ccc(CC(NC(=O)C(Cc2ccc(F)cc2)N(C(C)=O)C(=O)C=Cc2ccccc2)C(=O)NC(CC(C)C)C(=O)NC(CCCNC(N)=N)C(N)=O)cc1
: