Target
Proteinase-activated receptor 1
Ligand
BDBM50054896
Substrate
Meas. Tech.
ChEMBL_209254 (CHEMBL815695)
IC50
94000±n/a nM
Citation
 Bernatowicz, MSKlimas, CEHartl, KSPeluso, MAllegretto, NJSeiler, SM Development of potent thrombin receptor antagonist peptides. J Med Chem 39:4879-87 (1997)  
Target
Name:
Proteinase-activated receptor 1
Synonyms:
CF2R F2R PAR1 Proteinase activated receptor 1 TR Thrombin receptor/ Proteinase-activated receptor 1(Par-1)
Type:
Protein
Mol. Mass.:
47450.07
Organism:
Homo sapiens (Human)
Description:
P25116
Residue:
425
  
Inhibitor
Name:
BDBM50054896
Synonyms:
2-[2-[2-(Acetyl-phenyl-amino)-3-(4-fluoro-phenyl)-propionylamino]-3-(4-guanidino-phenyl)-propionylamino]-4-methyl-pentanoic acid (1-carbamoyl-4-guanidino-butyl)-amide | CHEMBL144849
Type:
Small organic molecule
Emp. Form.:
C39H52FN11O5
Mol. Mass.:
773.8993
SMILES:
[#6]-[#6](-[#6])-[#6]-[#6](-[#7]-[#6](=O)-[#6](-[#6]-c1ccc(cc1)\[#7]=[#6](\[#7])-[#7])-[#7]-[#6](=O)-[#6](-[#6]-c1ccc(F)cc1)-[#7](-[#6](-[#6])=O)-c1ccccc1)-[#6](=O)-[#7]-[#6](-[#6]-[#6]-[#6]-[#7]-[#6](-[#7])=[#7])-[#6](-[#7])=O
: