Target
Proteinase-activated receptor 1
Ligand
BDBM50054925
Substrate
Meas. Tech.
ChEMBL_209251 (CHEMBL815692)
IC50
46±n/a nM
Citation
 Bernatowicz, MSKlimas, CEHartl, KSPeluso, MAllegretto, NJSeiler, SM Development of potent thrombin receptor antagonist peptides. J Med Chem 39:4879-87 (1997)  
Target
Name:
Proteinase-activated receptor 1
Synonyms:
CF2R F2R PAR1 Proteinase activated receptor 1 TR Thrombin receptor/ Proteinase-activated receptor 1(Par-1)
Type:
Protein
Mol. Mass.:
47450.07
Organism:
Homo sapiens (Human)
Description:
P25116
Residue:
425
  
Inhibitor
Name:
BDBM50054925
Synonyms:
Biphenyl-4-carboxylic acid acetyl-[1-[1-[1-(1-carbamoyl-4-guanidino-butylcarbamoyl)-3-methyl-butylcarbamoyl]-2-(4-guanidino-phenyl)-ethylcarbamoyl]-2-(4-fluoro-phenyl)-ethyl]-amide | CHEMBL357900
Type:
Small organic molecule
Emp. Form.:
C46H56FN11O6
Mol. Mass.:
878.0053
SMILES:
[#6]-[#6](-[#6])-[#6]-[#6](-[#7]-[#6](=O)-[#6](-[#6]-c1ccc(cc1)\[#7]=[#6](\[#7])-[#7])-[#7]-[#6](=O)-[#6](-[#6]-c1ccc(F)cc1)-[#7](-[#6](-[#6])=O)-[#6](=O)-c1ccc(cc1)-c1ccccc1)-[#6](=O)-[#7]-[#6](-[#6]-[#6]-[#6]-[#7]-[#6](-[#7])=[#7])-[#6](-[#7])=O
: