Target
D(2) dopamine receptor
Ligand
BDBM50054991
Substrate
Meas. Tech.
ChEMBL_58563 (CHEMBL667498)
IC50
210±n/a nM
Citation
 Perrone, RBerardi, FColabufo, NALeopoldo, MTortorella, VFornaretto, MGCaccia, CMcArthur, RA Structure-activity relationship studies on the 5-HT(1A) receptor affinity of 1-phenyl-4-[omega-(alpha- or beta-tetralinyl)alkyl]piperazines. 4. J Med Chem 39:4928-34 (1997)  
Target
Name:
D(2) dopamine receptor
Synonyms:
DOPAMINE D2 DOPAMINE D2 Short Dopamine D2 receptor Drd2
Type:
G Protein-Coupled Receptor (GPCR)
Mol. Mass.:
50931.60
Organism:
Rattus norvegicus (rat)
Description:
P61169
Residue:
444
  
Inhibitor
Name:
BDBM50054991
Synonyms:
1-[2-(5-Methoxy-1,2,3,4-tetrahydro-naphthalen-1-yl)-ethyl]-4-phenyl-piperazine | CHEMBL144417
Type:
Small organic molecule
Emp. Form.:
C23H30N2O
Mol. Mass.:
350.4971
SMILES:
COc1cccc2C(CCN3CCN(CC3)c3ccccc3)CCCc12
: