Target
Platelet-activating factor receptor
Ligand
BDBM50055482
Substrate
Meas. Tech.
ChEMBL_155146 (CHEMBL760187)
IC50
50±n/a nM
Citation
 Sugano, MSato, ASaito, KTakaishi, SMatsushita, YIijima, Y Structure-activity relationships of phomactin derivatives as platelet activating factor antagonists. J Med Chem 39:5281-4 (1997)  
Target
Name:
Platelet-activating factor receptor
Synonyms:
PAF-R PTAFR_CAVPO Platelet-activating factor receptor
Type:
Protein
Mol. Mass.:
39005.63
Organism:
Cavia porcellus
Description:
Residue:
342
  
Inhibitor
Name:
BDBM50055482
Synonyms:
(E)-(1R,3S,5R,12S,13R,16S)-16-(Isoxazol-3-yloxymethyl)-5,9,12,13-tetramethyl-4-oxa-tricyclo[10.3.1.0*3,5*]hexadec-8-en-2-one | CHEMBL346391
Type:
Small organic molecule
Emp. Form.:
C23H33NO4
Mol. Mass.:
387.5124
SMILES:
C[C@@H]1CC[C@@H]2[C@H](COc3ccon3)[C@@]1(C)CC\C(C)=C\CC[C@@]1(C)O[C@@H]1C2=O
: