Target
Type-1 angiotensin II receptor
Ligand
BDBM50035451
Substrate
Meas. Tech.
ChEMBL_34648 (CHEMBL649707)
IC50
0.450000±n/a nM
Citation
 Wexler, RRGreenlee, WJIrvin, JDGoldberg, MRPrendergast, KSmith, RDTimmermans, PB Nonpeptide angiotensin II receptor antagonists: the next generation in antihypertensive therapy. J Med Chem 39:625-56 (1996)  
Target
Name:
Type-1 angiotensin II receptor
Synonyms:
AGTR1 ANGIOTENSIN AT1 Angiotensin II type 1a (AT-1a) receptor
Type:
Enzyme Catalytic Domain
Mol. Mass.:
41009.15
Organism:
RABBIT
Description:
ANGIOTENSIN AT1 AGTR1 RABBIT::P34976
Residue:
359
  
Inhibitor
Name:
BDBM50035451
Synonyms:
2-{4-[3-butyl-5-oxo-1-(2-trifluoromethylphenyl)-4,5-dihydro-1H-1,2,4-triazol-4-ylmethyl]phenyl}-1-(N-t-butoxycarbonyl)benzenesulfonamide 4'-[3-Butyl-5-oxo-1-(2-trifluoromethyl-phenyl)-1,5-dihydro-[1,2,4]triazol-4-ylmethyl]-biphenyl-2-sulfonic acid (2-tert-butoxycarbonyl)amide 5-n-Butyl-4-[[2'-[N-(tert-butoxycarbonyl)sulfamoyl]biphenyl-4yl]methyl]-2-[2-trifluoromethyl-phenyl]-2,4-dihydro-3H-1,2,4-triazol-3-one L-162234
Type:
Small organic molecule
Emp. Form.:
C31H33F3N4O5S
Mol. Mass.:
630.678
SMILES:
CCCCc1nn(-c2ccccc2C(F)(F)F)c(=O)n1Cc1ccc(cc1)-c1ccccc1S(=O)(=O)NC(=O)OC(C)(C)C
: