Target
Type-1 angiotensin II receptor
Ligand
BDBM82433
Substrate
Meas. Tech.
ChEMBL_34648 (CHEMBL649707)
IC50
1.7±n/a nM
Citation
 Wexler, RRGreenlee, WJIrvin, JDGoldberg, MRPrendergast, KSmith, RDTimmermans, PB Nonpeptide angiotensin II receptor antagonists: the next generation in antihypertensive therapy. J Med Chem 39:625-56 (1996)  
Target
Name:
Type-1 angiotensin II receptor
Synonyms:
AGTR1 ANGIOTENSIN AT1 Angiotensin II type 1a (AT-1a) receptor
Type:
Enzyme Catalytic Domain
Mol. Mass.:
41009.15
Organism:
RABBIT
Description:
ANGIOTENSIN AT1 AGTR1 RABBIT::P34976
Residue:
359
  
Inhibitor
Name:
BDBM82433
Synonyms:
CHEMBL302102 L-159689 | N-Pentyl-N-[[2-propyl-3-[[2'-(1H-tetrazol-5-yl)biphenyl-4-yl]methyl]-3,4-dihydro-4-oxoquinazolin]-6-yl]benzamide
Type:
Small organic molecule
Emp. Form.:
C37H37N7O2
Mol. Mass.:
611.7354
SMILES:
CCCCCN(C(=O)c1ccccc1)c1ccc2nc(CCC)n(Cc3ccc(cc3)-c3ccccc3-c3nnn[nH]3)c(=O)c2c1
: