Target
Type-2 angiotensin II receptor
Ligand
BDBM50010361
Substrate
Meas. Tech.
ChEMBL_35421 (CHEMBL643595)
IC50
66±n/a nM
Citation
 Wexler, RRGreenlee, WJIrvin, JDGoldberg, MRPrendergast, KSmith, RDTimmermans, PB Nonpeptide angiotensin II receptor antagonists: the next generation in antihypertensive therapy. J Med Chem 39:625-56 (1996)  
Target
Name:
Type-2 angiotensin II receptor
Synonyms:
AGTR2 AT2 Angiotensin II type 2 (AT-2) receptor Type-2 angiotensin II receptor
Type:
Enzyme Catalytic Domain
Mol. Mass.:
41201.61
Organism:
Homo sapiens (Human)
Description:
Angiotensin II, central 0 0::P50052
Residue:
363
  
Inhibitor
Name:
BDBM50010361
Synonyms:
(S)-1-(4-Amino-3-methyl-benzyl)-5-diphenylacetyl-4,5,6,7-tetrahydro-1H-imidazo[4,5-c]pyridine-6-carboxylic acid 1-(4-amino-2-methylbenzyl)-5-diphenylcarbamoyl-(6S)-4,5,6,7-tetrahydro-1H-imidazo[5,4-c]pyridine-6-carboxylic acid EXP655 PD-123177
Type:
Small organic molecule
Emp. Form.:
C29H28N4O3
Mol. Mass.:
480.5576
SMILES:
Cc1cc(Cn2cnc3CN([C@@H](Cc23)C(O)=O)C(=O)C(c2ccccc2)c2ccccc2)ccc1N
: