Target
Type-1 angiotensin II receptor
Ligand
BDBM50030711
Substrate
Meas. Tech.
ChEMBL_35254 (CHEMBL647575)
IC50
0.20±n/a nM
Citation
 Wexler, RRGreenlee, WJIrvin, JDGoldberg, MRPrendergast, KSmith, RDTimmermans, PB Nonpeptide angiotensin II receptor antagonists: the next generation in antihypertensive therapy. J Med Chem 39:625-56 (1996)  
Target
Name:
Type-1 angiotensin II receptor
Synonyms:
AGTR1 AGTR1B AT1 AT1BR AT2R1B Angiotensin II receptor Type-1 angiotensin II receptor (AT1)
Type:
Protein
Mol. Mass.:
41080.75
Organism:
Homo sapiens (Human)
Description:
P30556
Residue:
359
  
Inhibitor
Name:
BDBM50030711
Synonyms:
CHEMBL338027 Pentanoic acid {4-bromo-3-[3-ethyl-4-(3-fluoro-2'-(N-t-butyloxycarbonyl)-Sulfanamido-biphenyl-4-ylmethyl)-5-oxo-4,5-dihydro-[1,2,4]triazol-1-yl]-phenyl}-amide | Pentanoic acid {4-bromo-3-[3-ethyl-4-(3-fluoro-2'-tert-butyloxycarbonylsulfamoyl-biphenyl-4-ylmethyl)-5-oxo-45-dihydro-[124]triazol-1-yl]-phenyl}-amide(L-163958)
Type:
Small organic molecule
Emp. Form.:
C33H37BrFN5O6S
Mol. Mass.:
730.644
SMILES:
CCCCC(=O)Nc1ccc(Br)c(c1)-n1nc(CC)n(Cc2ccc(cc2F)-c2ccccc2S(=O)(=O)NC(=O)OC(C)(C)C)c1=O
: